{"text_format":"1","workbook":"xlsx","n_sheets":12,"sheets":["Concours","Séries","Day 1","Day 2","Day 3","Day 4","Day 5","Day 6","Day 7","Day 8","Day 9","Series Counts"],"not_rendered":{"charts":0,"images":0,"macros":1,"external_links":0,"defined_names":11,"comments":9,"pivot_tables":1},"unopened":[],"bounds":{"document_bytes":16777216,"sheet_cells":100000,"rows_first":2000,"rows_last":500,"rows_between":2000,"halvings":0,"cell_chars":16384,"cell_head_chars":4096},"cells_cut":0,"cells_raw":0,"read":"whole","date_system":"1900"}

{"sheet":"Concours","index":0,"n_rows":1,"n_cols":8,"rows_kept":1,"cut":false,"hidden":false,"merged":[]}
["Concours ID",null,"DateOrdre","DateDate","DateID",null,"JuryNum","JuryID"]

{"sheet":"Séries","index":1,"n_rows":949,"n_cols":26,"rows_kept":949,"cut":false,"hidden":false,"merged":[]}
["SeriID","SeriNum","Qtt","SeriName","Quality","QttQlt","QttQlt/Qtt","SeriRemPrepa","Serie","Jour","Jury","Ordre","JourID","JuryID","Adrs","SeriSummary",{"$f":"SUM(C2:C999)","v":0},{"$f":"'Day 1'!AG1+'Day 2'!AG1+'Day 3'!AG1","v":0},null,null,"ImportKey","SeriID","SeriOrdreSerie","SeriDateID","SeriJuryID","SeriConcoursID"]
[null,null,null,null,null,null,null,null,null,null,null,null,null,null,null,null,null,null,null,null,null,{"$f":"A2","v":0},{"$f":"L2","v":0},{"$f":"M2","v":0},{"$f":"N2","v":0},{"$f":"Concours!$A$2","v":0}]
[null,null,null,null,null,null,null,null,null,null,null,null,null,null,null,null,null,null,null,null,null,0,0,0,0,{"$f":"Concours!$A$2","v":0}]
[null,null,null,null,null,null,null,null,null,null,null,null,null,null,null,null,null,null,null,null,null,0,0,0,0,{"$f":"Concours!$A$2","v":0}]
[null,null,null,null,null,null,null,null,null,null,null,null,null,null,null,null,null,null,null,null,null,0,0,0,0,{"$f":"Concours!$A$2","v":0}]
[null,null,null,null,null,null,null,null,null,null,null,null,null,null,null,null,null,null,null,null,null,0,0,0,0,{"$f":"Concours!$A$2","v":0}]
[null,null,null,null,null,null,null,null,null,null,null,null,null,null,null,null,null,null,null,null,null,0,0,0,0,{"$f":"Concours!$A$2","v":0}]
[null,null,null,null,null,null,null,null,null,null,null,null,null,null,null,null,null,null,null,null,null,0,0,0,0,{"$f":"Concours!$A$2","v":0}]
[null,null,null,null,null,null,null,null,null,null,null,null,null,null,null,null,null,null,null,null,null,0,0,0,0,{"$f":"Concours!$A$2","v":0}]
[null,null,null,null,null,null,null,null,null,null,null,null,null,null,null,null,null,null,null,null,null,0,0,0,0,{"$f":"Concours!$A$2","v":0}]
{"$rows_left_out":940}
{"sheet":"Day 1","index":2,"n_rows":93,"n_cols":41,"rows_kept":93,"cut":false,"hidden":false,"merged":[[84,20,84,23],[84,24,84,27],[84,28,84,31],[84,32,84,35],[84,36,84,39],[84,0,84,3],[84,4,84,7],[84,8,84,11],[84,12,84,15],[84,16,84,19],[75,20,75,23],[75,24,75,27],[75,28,75,31],[75,32,75,35],[75,36,75,39],[75,0,75,3],[75,4,75,7],[75,8,75,11],[75,12,75,15],[75,16,75,19],[66,20,66,23],[66,24,66,27],[66,28,66,31],[66,32,66,35],[66,36,66,39],[66,0,66,3],[66,4,66,7],[66,8,66,11],[66,12,66,15],[66,16,66,19],[57,20,57,23],[57,24,57,27],[57,28,57,31],[57,32,57,35],[57,36,57,39],[57,0,57,3],[57,4,57,7],[57,8,57,11],[57,12,57,15],[57,16,57,19],[0,0,1,2],[0,3,1,8],[0,32,1,40],[3,0,3,3],[3,4,3,7],[3,8,3,11],[3,12,3,15],[3,16,3,19],[3,24,3,27],[0,11,1,19],[3,28,3,31],[3,32,3,35],[3,36,3,39],[3,20,3,23],[12,32,12,35],[12,36,12,39],[21,32,21,35],[12,16,12,19],[12,20,12,23],[21,36,21,39],[12,24,12,27],[12,28,12,31],[21,24,21,27],[21,28,21,31],[21,16,21,19],[21,20,21,23],[12,8,12,11],[12,12,12,15],[21,8,21,11],[21,12,21,15],[30,0,30,3],[30,4,30,7],[30,8,30,11],[30,12,30,15],[12,0,12,3],[12,4,12,7],[21,0,21,3],[21,4,21,7],[30,16,30,19],[39,8,39,11],[39,12,39,15],[30,36,30,39],[39,36,39,39],[30,32,30,35],[30,20,30,23],[30,24,30,27],[30,28,30,31],[39,28,39,31],[48,36,48,39],[39,24,39,27],[48,0,48,3],[48,4,48,7],[48,8,48,11],[48,12,48,15],[39,0,39,3],[39,4,39,7],[48,16,48,19],[48,20,48,23],[48,24,48,27],[48,28,48,31],[39,32,39,35],[39,16,39,19],[39,20,39,23],[48,32,48,35]]}
[1,null,null,"<= Jour",null,null,null,null,null,null,null,{"$f":"VLOOKUP(A1,Concours!$C$1:$E$15,2,0)","v":{"$error":"#N/A"}},null,null,null,null,null,null,null,null,null,null,null,null,null,null,null,null,null,null,null,null,{"$f":"SUM(AO10:AO129)","v":0}]
[]
[]
[1,null,null,null,{"$f":"A4+1","v":2},null,null,null,{"$f":"E4+1","v":3},null,null,null,{"$f":"I4+1","v":4},null,null,null,{"$f":"M4+1","v":5},null,null,null,{"$f":"Q4+1","v":6},null,null,null,{"$f":"U4+1","v":7},null,null,null,{"$f":"Y4+1","v":8},null,null,null,{"$f":"AC4+1","v":9},null,null,null,{"$f":"AG4+1","v":10}]
[]
[]
[]
[]
[]
[]
{"$rows_left_out":84}
{"sheet":"Day 2","index":3,"n_rows":93,"n_cols":41,"rows_kept":93,"cut":false,"hidden":false,"merged":[[66,36,66,39],[75,0,75,3],[75,4,75,7],[75,8,75,11],[75,12,75,15],[75,16,75,19],[75,20,75,23],[84,24,84,27],[84,28,84,31],[84,32,84,35],[84,36,84,39],[75,24,75,27],[75,28,75,31],[75,32,75,35],[75,36,75,39],[84,0,84,3],[84,4,84,7],[84,8,84,11],[84,12,84,15],[84,16,84,19],[84,20,84,23],[66,0,66,3],[66,4,66,7],[66,8,66,11],[66,12,66,15],[66,16,66,19],[66,20,66,23],[66,24,66,27],[66,28,66,31],[66,32,66,35],[48,36,48,39],[57,0,57,3],[57,4,57,7],[57,8,57,11],[57,12,57,15],[57,16,57,19],[57,20,57,23],[57,24,57,27],[57,28,57,31],[57,32,57,35],[57,36,57,39],[48,0,48,3],[48,4,48,7],[48,8,48,11],[48,12,48,15],[48,16,48,19],[48,20,48,23],[48,24,48,27],[48,28,48,31],[48,32,48,35],[30,36,30,39],[39,0,39,3],[39,4,39,7],[39,8,39,11],[39,12,39,15],[39,16,39,19],[39,20,39,23],[39,24,39,27],[39,28,39,31],[39,32,39,35],[39,36,39,39],[30,0,30,3],[30,4,30,7],[30,8,30,11],[30,12,30,15],[30,16,30,19],[30,20,30,23],[30,24,30,27],[30,28,30,31],[30,32,30,35],[12,36,12,39],[21,0,21,3],[21,4,21,7],[21,8,21,11],[21,12,21,15],[21,16,21,19],[21,20,21,23],[21,24,21,27],[21,28,21,31],[21,32,21,35],[21,36,21,39],[12,0,12,3],[12,4,12,7],[12,8,12,11],[12,12,12,15],[12,16,12,19],[12,20,12,23],[12,24,12,27],[12,28,12,31],[12,32,12,35],[0,0,1,2],[0,3,1,8],[0,11,1,19],[0,32,1,40],[3,0,3,3],[3,4,3,7],[3,8,3,11],[3,12,3,15],[3,16,3,19],[3,20,3,23],[3,24,3,27],[3,28,3,31],[3,32,3,35],[3,36,3,39]]}
[2,null,null,"<= Jour",null,null,null,null,null,null,null,{"$f":"VLOOKUP(A1,Concours!$C$1:$E$15,2,0)","v":{"$error":"#N/A"}},null,null,null,null,null,null,null,null,null,null,null,null,null,null,null,null,null,null,null,null,{"$f":"SUM(AO10:AO129)","v":0}]
[]
[]
[1,null,null,null,{"$f":"A4+1","v":2},null,null,null,{"$f":"E4+1","v":3},null,null,null,{"$f":"I4+1","v":4},null,null,null,{"$f":"M4+1","v":5},null,null,null,{"$f":"Q4+1","v":6},null,null,null,{"$f":"U4+1","v":7},null,null,null,{"$f":"Y4+1","v":8},null,null,null,{"$f":"AC4+1","v":9},null,null,null,{"$f":"AG4+1","v":10}]
[]
[]
[]
[]
[]
[]
{"$rows_left_out":84}
{"sheet":"Day 3","index":4,"n_rows":93,"n_cols":41,"rows_kept":93,"cut":false,"hidden":false,"merged":[[66,36,66,39],[75,0,75,3],[75,4,75,7],[75,8,75,11],[75,12,75,15],[75,16,75,19],[75,20,75,23],[84,24,84,27],[84,28,84,31],[84,32,84,35],[84,36,84,39],[75,24,75,27],[75,28,75,31],[75,32,75,35],[75,36,75,39],[84,0,84,3],[84,4,84,7],[84,8,84,11],[84,12,84,15],[84,16,84,19],[84,20,84,23],[66,0,66,3],[66,4,66,7],[66,8,66,11],[66,12,66,15],[66,16,66,19],[66,20,66,23],[66,24,66,27],[66,28,66,31],[66,32,66,35],[48,36,48,39],[57,0,57,3],[57,4,57,7],[57,8,57,11],[57,12,57,15],[57,16,57,19],[57,20,57,23],[57,24,57,27],[57,28,57,31],[57,32,57,35],[57,36,57,39],[48,0,48,3],[48,4,48,7],[48,8,48,11],[48,12,48,15],[48,16,48,19],[48,20,48,23],[48,24,48,27],[48,28,48,31],[48,32,48,35],[30,36,30,39],[39,0,39,3],[39,4,39,7],[39,8,39,11],[39,12,39,15],[39,16,39,19],[39,20,39,23],[39,24,39,27],[39,28,39,31],[39,32,39,35],[39,36,39,39],[30,0,30,3],[30,4,30,7],[30,8,30,11],[30,12,30,15],[30,16,30,19],[30,20,30,23],[30,24,30,27],[30,28,30,31],[30,32,30,35],[12,36,12,39],[21,0,21,3],[21,4,21,7],[21,8,21,11],[21,12,21,15],[21,16,21,19],[21,20,21,23],[21,24,21,27],[21,28,21,31],[21,32,21,35],[21,36,21,39],[12,0,12,3],[12,4,12,7],[12,8,12,11],[12,12,12,15],[12,16,12,19],[12,20,12,23],[12,24,12,27],[12,28,12,31],[12,32,12,35],[0,0,1,2],[0,3,1,8],[0,11,1,19],[0,32,1,40],[3,0,3,3],[3,4,3,7],[3,8,3,11],[3,12,3,15],[3,16,3,19],[3,20,3,23],[3,24,3,27],[3,28,3,31],[3,32,3,35],[3,36,3,39]]}
[3,null,null,"<= Jour",null,null,null,null,null,null,null,{"$f":"VLOOKUP(A1,Concours!$C$1:$E$15,2,0)","v":{"$error":"#N/A"}},null,null,null,null,null,null,null,null,null,null,null,null,null,null,null,null,null,null,null,null,{"$f":"SUM(AO10:AO129)","v":0}]
[]
[]
[1,null,null,null,{"$f":"A4+1","v":2},null,null,null,{"$f":"E4+1","v":3},null,null,null,{"$f":"I4+1","v":4},null,null,null,{"$f":"M4+1","v":5},null,null,null,{"$f":"Q4+1","v":6},null,null,null,{"$f":"U4+1","v":7},null,null,null,{"$f":"Y4+1","v":8},null,null,null,{"$f":"AC4+1","v":9},null,null,null,{"$f":"AG4+1","v":10}]
[]
[]
[]
[]
[]
[]
{"$rows_left_out":84}
{"sheet":"Day 4","index":5,"n_rows":93,"n_cols":41,"rows_kept":93,"cut":false,"hidden":false,"merged":[[0,0,1,2],[0,3,1,8],[0,11,1,19],[0,32,1,40],[3,0,3,3],[3,4,3,7],[3,8,3,11],[3,12,3,15],[3,16,3,19],[3,20,3,23],[3,24,3,27],[3,28,3,31],[3,32,3,35],[3,36,3,39],[12,0,12,3],[12,4,12,7],[12,8,12,11],[12,12,12,15],[12,16,12,19],[12,20,12,23],[12,24,12,27],[12,28,12,31],[12,32,12,35],[12,36,12,39],[21,0,21,3],[21,4,21,7],[21,8,21,11],[21,12,21,15],[21,16,21,19],[21,20,21,23],[21,24,21,27],[21,28,21,31],[21,32,21,35],[21,36,21,39],[30,0,30,3],[30,4,30,7],[30,8,30,11],[30,12,30,15],[30,16,30,19],[30,20,30,23],[30,24,30,27],[30,28,30,31],[30,32,30,35],[30,36,30,39],[39,0,39,3],[39,4,39,7],[39,8,39,11],[39,12,39,15],[39,16,39,19],[39,20,39,23],[39,24,39,27],[39,28,39,31],[39,32,39,35],[39,36,39,39],[48,0,48,3],[48,4,48,7],[48,8,48,11],[48,12,48,15],[48,16,48,19],[48,20,48,23],[48,24,48,27],[48,28,48,31],[48,32,48,35],[48,36,48,39],[57,0,57,3],[57,4,57,7],[57,8,57,11],[57,12,57,15],[57,16,57,19],[57,20,57,23],[57,24,57,27],[57,28,57,31],[57,32,57,35],[57,36,57,39],[66,0,66,3],[66,4,66,7],[66,8,66,11],[66,12,66,15],[66,16,66,19],[66,20,66,23],[66,24,66,27],[66,28,66,31],[66,32,66,35],[66,36,66,39],[75,0,75,3],[75,4,75,7],[75,8,75,11],[75,12,75,15],[75,16,75,19],[75,20,75,23],[84,24,84,27],[84,28,84,31],[84,32,84,35],[84,36,84,39],[75,24,75,27],[75,28,75,31],[75,32,75,35],[75,36,75,39],[84,0,84,3],[84,4,84,7],[84,8,84,11],[84,12,84,15],[84,16,84,19],[84,20,84,23]]}
[4,null,null,"<= Jour",null,null,null,null,null,null,null,{"$f":"VLOOKUP(A1,Concours!$C$1:$E$15,2,0)","v":{"$error":"#N/A"}},null,null,null,null,null,null,null,null,null,null,null,null,null,null,null,null,null,null,null,null,{"$f":"SUM(AO10:AO129)","v":0}]
[]
[]
[1,null,null,null,{"$f":"A4+1","v":2},null,null,null,{"$f":"E4+1","v":3},null,null,null,{"$f":"I4+1","v":4},null,null,null,{"$f":"M4+1","v":5},null,null,null,{"$f":"Q4+1","v":6},null,null,null,{"$f":"U4+1","v":7},null,null,null,{"$f":"Y4+1","v":8},null,null,null,{"$f":"AC4+1","v":9},null,null,null,{"$f":"AG4+1","v":10}]
[]
[]
[]
[]
[]
[]
{"$rows_left_out":84}
{"sheet":"Day 5","index":6,"n_rows":93,"n_cols":41,"rows_kept":93,"cut":false,"hidden":false,"merged":[[0,0,1,2],[0,3,1,8],[0,11,1,19],[0,32,1,40],[3,0,3,3],[3,4,3,7],[3,8,3,11],[3,12,3,15],[3,16,3,19],[3,20,3,23],[3,24,3,27],[3,28,3,31],[3,32,3,35],[3,36,3,39],[12,0,12,3],[12,4,12,7],[12,8,12,11],[12,12,12,15],[12,16,12,19],[12,20,12,23],[12,24,12,27],[12,28,12,31],[12,32,12,35],[12,36,12,39],[21,0,21,3],[21,4,21,7],[21,8,21,11],[21,12,21,15],[21,16,21,19],[21,20,21,23],[21,24,21,27],[21,28,21,31],[21,32,21,35],[21,36,21,39],[30,0,30,3],[30,4,30,7],[30,8,30,11],[30,12,30,15],[30,16,30,19],[30,20,30,23],[30,24,30,27],[30,28,30,31],[30,32,30,35],[30,36,30,39],[39,0,39,3],[39,4,39,7],[39,8,39,11],[39,12,39,15],[39,16,39,19],[39,20,39,23],[39,24,39,27],[39,28,39,31],[39,32,39,35],[39,36,39,39],[48,0,48,3],[48,4,48,7],[48,8,48,11],[48,12,48,15],[48,16,48,19],[48,20,48,23],[48,24,48,27],[48,28,48,31],[48,32,48,35],[48,36,48,39],[57,0,57,3],[57,4,57,7],[57,8,57,11],[57,12,57,15],[57,16,57,19],[57,20,57,23],[57,24,57,27],[57,28,57,31],[57,32,57,35],[57,36,57,39],[66,0,66,3],[66,4,66,7],[66,8,66,11],[66,12,66,15],[66,16,66,19],[66,20,66,23],[66,24,66,27],[66,28,66,31],[66,32,66,35],[66,36,66,39],[75,0,75,3],[75,4,75,7],[75,8,75,11],[75,12,75,15],[75,16,75,19],[75,20,75,23],[84,24,84,27],[84,28,84,31],[84,32,84,35],[84,36,84,39],[75,24,75,27],[75,28,75,31],[75,32,75,35],[75,36,75,39],[84,0,84,3],[84,4,84,7],[84,8,84,11],[84,12,84,15],[84,16,84,19],[84,20,84,23]]}
[5,null,null,"<= Jour",null,null,null,null,null,null,null,{"$f":"VLOOKUP(A1,Concours!$C$1:$E$15,2,0)","v":{"$error":"#N/A"}},null,null,null,null,null,null,null,null,null,null,null,null,null,null,null,null,null,null,null,null,{"$f":"SUM(AO10:AO129)","v":0}]
[]
[]
[1,null,null,null,{"$f":"A4+1","v":2},null,null,null,{"$f":"E4+1","v":3},null,null,null,{"$f":"I4+1","v":4},null,null,null,{"$f":"M4+1","v":5},null,null,null,{"$f":"Q4+1","v":6},null,null,null,{"$f":"U4+1","v":7},null,null,null,{"$f":"Y4+1","v":8},null,null,null,{"$f":"AC4+1","v":9},null,null,null,{"$f":"AG4+1","v":10}]
[]
[]
[]
[]
[]
[]
{"$rows_left_out":84}
{"sheet":"Day 6","index":7,"n_rows":93,"n_cols":41,"rows_kept":93,"cut":false,"hidden":false,"merged":[[0,0,1,2],[0,3,1,8],[0,11,1,19],[0,32,1,40],[3,0,3,3],[3,4,3,7],[3,8,3,11],[3,12,3,15],[3,16,3,19],[3,20,3,23],[3,24,3,27],[3,28,3,31],[3,32,3,35],[3,36,3,39],[12,0,12,3],[12,4,12,7],[12,8,12,11],[12,12,12,15],[12,16,12,19],[12,20,12,23],[12,24,12,27],[12,28,12,31],[12,32,12,35],[12,36,12,39],[21,0,21,3],[21,4,21,7],[21,8,21,11],[21,12,21,15],[21,16,21,19],[21,20,21,23],[21,24,21,27],[21,28,21,31],[21,32,21,35],[21,36,21,39],[30,0,30,3],[30,4,30,7],[30,8,30,11],[30,12,30,15],[30,16,30,19],[30,20,30,23],[30,24,30,27],[30,28,30,31],[30,32,30,35],[30,36,30,39],[39,0,39,3],[39,4,39,7],[39,8,39,11],[39,12,39,15],[39,16,39,19],[39,20,39,23],[39,24,39,27],[39,28,39,31],[39,32,39,35],[39,36,39,39],[48,0,48,3],[48,4,48,7],[48,8,48,11],[48,12,48,15],[48,16,48,19],[48,20,48,23],[48,24,48,27],[48,28,48,31],[48,32,48,35],[48,36,48,39],[57,0,57,3],[57,4,57,7],[57,8,57,11],[57,12,57,15],[57,16,57,19],[57,20,57,23],[57,24,57,27],[57,28,57,31],[57,32,57,35],[57,36,57,39],[66,0,66,3],[66,4,66,7],[66,8,66,11],[66,12,66,15],[66,16,66,19],[66,20,66,23],[66,24,66,27],[66,28,66,31],[66,32,66,35],[66,36,66,39],[75,0,75,3],[75,4,75,7],[75,8,75,11],[75,12,75,15],[75,16,75,19],[75,20,75,23],[84,24,84,27],[84,28,84,31],[84,32,84,35],[84,36,84,39],[75,24,75,27],[75,28,75,31],[75,32,75,35],[75,36,75,39],[84,0,84,3],[84,4,84,7],[84,8,84,11],[84,12,84,15],[84,16,84,19],[84,20,84,23]]}
[6,null,null,"<= Jour",null,null,null,null,null,null,null,{"$f":"VLOOKUP(A1,Concours!$C$1:$E$15,2,0)","v":{"$error":"#N/A"}},null,null,null,null,null,null,null,null,null,null,null,null,null,null,null,null,null,null,null,null,{"$f":"SUM(AO10:AO129)","v":0}]
[]
[]
[1,null,null,null,{"$f":"A4+1","v":2},null,null,null,{"$f":"E4+1","v":3},null,null,null,{"$f":"I4+1","v":4},null,null,null,{"$f":"M4+1","v":5},null,null,null,{"$f":"Q4+1","v":6},null,null,null,{"$f":"U4+1","v":7},null,null,null,{"$f":"Y4+1","v":8},null,null,null,{"$f":"AC4+1","v":9},null,null,null,{"$f":"AG4+1","v":10}]
[]
[]
[]
[]
[]
[]
{"$rows_left_out":84}
{"sheet":"Day 7","index":8,"n_rows":93,"n_cols":41,"rows_kept":93,"cut":false,"hidden":false,"merged":[[0,0,1,2],[0,3,1,8],[0,11,1,19],[0,32,1,40],[3,0,3,3],[3,4,3,7],[3,8,3,11],[3,12,3,15],[3,16,3,19],[3,20,3,23],[3,24,3,27],[3,28,3,31],[3,32,3,35],[3,36,3,39],[12,0,12,3],[12,4,12,7],[12,8,12,11],[12,12,12,15],[12,16,12,19],[12,20,12,23],[12,24,12,27],[12,28,12,31],[12,32,12,35],[12,36,12,39],[21,0,21,3],[21,4,21,7],[21,8,21,11],[21,12,21,15],[21,16,21,19],[21,20,21,23],[21,24,21,27],[21,28,21,31],[21,32,21,35],[21,36,21,39],[30,0,30,3],[30,4,30,7],[30,8,30,11],[30,12,30,15],[30,16,30,19],[30,20,30,23],[30,24,30,27],[30,28,30,31],[30,32,30,35],[30,36,30,39],[39,0,39,3],[39,4,39,7],[39,8,39,11],[39,12,39,15],[39,16,39,19],[39,20,39,23],[39,24,39,27],[39,28,39,31],[39,32,39,35],[39,36,39,39],[48,0,48,3],[48,4,48,7],[48,8,48,11],[48,12,48,15],[48,16,48,19],[48,20,48,23],[48,24,48,27],[48,28,48,31],[48,32,48,35],[48,36,48,39],[57,0,57,3],[57,4,57,7],[57,8,57,11],[57,12,57,15],[57,16,57,19],[57,20,57,23],[57,24,57,27],[57,28,57,31],[57,32,57,35],[57,36,57,39],[66,0,66,3],[66,4,66,7],[66,8,66,11],[66,12,66,15],[66,16,66,19],[66,20,66,23],[66,24,66,27],[66,28,66,31],[66,32,66,35],[66,36,66,39],[75,0,75,3],[75,4,75,7],[75,8,75,11],[75,12,75,15],[75,16,75,19],[75,20,75,23],[84,24,84,27],[84,28,84,31],[84,32,84,35],[84,36,84,39],[75,24,75,27],[75,28,75,31],[75,32,75,35],[75,36,75,39],[84,0,84,3],[84,4,84,7],[84,8,84,11],[84,12,84,15],[84,16,84,19],[84,20,84,23]]}
[7,null,null,"<= Jour",null,null,null,null,null,null,null,{"$f":"VLOOKUP(A1,Concours!$C$1:$E$15,2,0)","v":{"$error":"#N/A"}},null,null,null,null,null,null,null,null,null,null,null,null,null,null,null,null,null,null,null,null,{"$f":"SUM(AO10:AO129)","v":0}]
[]
[]
[1,null,null,null,{"$f":"A4+1","v":2},null,null,null,{"$f":"E4+1","v":3},null,null,null,{"$f":"I4+1","v":4},null,null,null,{"$f":"M4+1","v":5},null,null,null,{"$f":"Q4+1","v":6},null,null,null,{"$f":"U4+1","v":7},null,null,null,{"$f":"Y4+1","v":8},null,null,null,{"$f":"AC4+1","v":9},null,null,null,{"$f":"AG4+1","v":10}]
[]
[]
[]
[]
[]
[]
{"$rows_left_out":84}
{"sheet":"Day 8","index":9,"n_rows":93,"n_cols":41,"rows_kept":93,"cut":false,"hidden":false,"merged":[[0,0,1,2],[0,3,1,8],[0,11,1,19],[0,32,1,40],[3,0,3,3],[3,4,3,7],[3,8,3,11],[3,12,3,15],[3,16,3,19],[3,20,3,23],[3,24,3,27],[3,28,3,31],[3,32,3,35],[3,36,3,39],[12,0,12,3],[12,4,12,7],[12,8,12,11],[12,12,12,15],[12,16,12,19],[12,20,12,23],[12,24,12,27],[12,28,12,31],[12,32,12,35],[12,36,12,39],[21,0,21,3],[21,4,21,7],[21,8,21,11],[21,12,21,15],[21,16,21,19],[21,20,21,23],[21,24,21,27],[21,28,21,31],[21,32,21,35],[21,36,21,39],[30,0,30,3],[30,4,30,7],[30,8,30,11],[30,12,30,15],[30,16,30,19],[30,20,30,23],[30,24,30,27],[30,28,30,31],[30,32,30,35],[30,36,30,39],[39,0,39,3],[39,4,39,7],[39,8,39,11],[39,12,39,15],[39,16,39,19],[39,20,39,23],[39,24,39,27],[39,28,39,31],[39,32,39,35],[39,36,39,39],[48,0,48,3],[48,4,48,7],[48,8,48,11],[48,12,48,15],[48,16,48,19],[48,20,48,23],[48,24,48,27],[48,28,48,31],[48,32,48,35],[48,36,48,39],[57,0,57,3],[57,4,57,7],[57,8,57,11],[57,12,57,15],[57,16,57,19],[57,20,57,23],[57,24,57,27],[57,28,57,31],[57,32,57,35],[57,36,57,39],[66,0,66,3],[66,4,66,7],[66,8,66,11],[66,12,66,15],[66,16,66,19],[66,20,66,23],[66,24,66,27],[66,28,66,31],[66,32,66,35],[66,36,66,39],[75,0,75,3],[75,4,75,7],[75,8,75,11],[75,12,75,15],[75,16,75,19],[75,20,75,23],[84,24,84,27],[84,28,84,31],[84,32,84,35],[84,36,84,39],[75,24,75,27],[75,28,75,31],[75,32,75,35],[75,36,75,39],[84,0,84,3],[84,4,84,7],[84,8,84,11],[84,12,84,15],[84,16,84,19],[84,20,84,23]]}
[8,null,null,"<= Jour",null,null,null,null,null,null,null,{"$f":"VLOOKUP(A1,Concours!$C$1:$E$15,2,0)","v":{"$error":"#N/A"}},null,null,null,null,null,null,null,null,null,null,null,null,null,null,null,null,null,null,null,null,{"$f":"SUM(AO10:AO129)","v":0}]
[]
[]
[1,null,null,null,{"$f":"A4+1","v":2},null,null,null,{"$f":"E4+1","v":3},null,null,null,{"$f":"I4+1","v":4},null,null,null,{"$f":"M4+1","v":5},null,null,null,{"$f":"Q4+1","v":6},null,null,null,{"$f":"U4+1","v":7},null,null,null,{"$f":"Y4+1","v":8},null,null,null,{"$f":"AC4+1","v":9},null,null,null,{"$f":"AG4+1","v":10}]
[]
[]
[]
[]
[]
[]
{"$rows_left_out":84}
{"sheet":"Day 9","index":10,"n_rows":93,"n_cols":41,"rows_kept":93,"cut":false,"hidden":false,"merged":[[0,0,1,2],[0,3,1,8],[0,11,1,19],[0,32,1,40],[3,0,3,3],[3,4,3,7],[3,8,3,11],[3,12,3,15],[3,16,3,19],[3,20,3,23],[3,24,3,27],[3,28,3,31],[3,32,3,35],[3,36,3,39],[12,0,12,3],[12,4,12,7],[12,8,12,11],[12,12,12,15],[12,16,12,19],[12,20,12,23],[12,24,12,27],[12,28,12,31],[12,32,12,35],[12,36,12,39],[21,0,21,3],[21,4,21,7],[21,8,21,11],[21,12,21,15],[21,16,21,19],[21,20,21,23],[21,24,21,27],[21,28,21,31],[21,32,21,35],[21,36,21,39],[30,0,30,3],[30,4,30,7],[30,8,30,11],[30,12,30,15],[30,16,30,19],[30,20,30,23],[30,24,30,27],[30,28,30,31],[30,32,30,35],[30,36,30,39],[39,0,39,3],[39,4,39,7],[39,8,39,11],[39,12,39,15],[39,16,39,19],[39,20,39,23],[39,24,39,27],[39,28,39,31],[39,32,39,35],[39,36,39,39],[48,0,48,3],[48,4,48,7],[48,8,48,11],[48,12,48,15],[48,16,48,19],[48,20,48,23],[48,24,48,27],[48,28,48,31],[48,32,48,35],[48,36,48,39],[57,0,57,3],[57,4,57,7],[57,8,57,11],[57,12,57,15],[57,16,57,19],[57,20,57,23],[57,24,57,27],[57,28,57,31],[57,32,57,35],[57,36,57,39],[66,0,66,3],[66,4,66,7],[66,8,66,11],[66,12,66,15],[66,16,66,19],[66,20,66,23],[66,24,66,27],[66,28,66,31],[66,32,66,35],[66,36,66,39],[75,0,75,3],[75,4,75,7],[75,8,75,11],[75,12,75,15],[75,16,75,19],[75,20,75,23],[84,24,84,27],[84,28,84,31],[84,32,84,35],[84,36,84,39],[75,24,75,27],[75,28,75,31],[75,32,75,35],[75,36,75,39],[84,0,84,3],[84,4,84,7],[84,8,84,11],[84,12,84,15],[84,16,84,19],[84,20,84,23]]}
[9,null,null,"<= Jour",null,null,null,null,null,null,null,{"$f":"VLOOKUP(A1,Concours!$C$1:$E$15,2,0)","v":{"$error":"#N/A"}},null,null,null,null,null,null,null,null,null,null,null,null,null,null,null,null,null,null,null,null,{"$f":"SUM(AO10:AO129)","v":0}]
[]
[]
[1,null,null,null,{"$f":"A4+1","v":2},null,null,null,{"$f":"E4+1","v":3},null,null,null,{"$f":"I4+1","v":4},null,null,null,{"$f":"M4+1","v":5},null,null,null,{"$f":"Q4+1","v":6},null,null,null,{"$f":"U4+1","v":7},null,null,null,{"$f":"Y4+1","v":8},null,null,null,{"$f":"AC4+1","v":9},null,null,null,{"$f":"AG4+1","v":10}]
[]
[]
[]
[]
[]
[]
{"$rows_left_out":84}
{"sheet":"Series Counts","index":11,"n_rows":7,"n_cols":3,"rows_kept":7,"cut":false,"hidden":false,"merged":[]}
[null,"Values"]
["Étiquettes de lignes","Sum of Qtt","Average of Quality"]
["(vide)"]
["(vide)"]
[]
["(vide)"]
["Total général"]